Target
Leukotriene B4 receptor 2
Ligand
BDBM50297387
Substrate
Ki
6000±n/a nM
Comments
PDSP_1117
Citation
 Wang, SGustafson, EPang, LQiao, XBehan, JMaguire, MBayne, MLaz, T A novel hepatointestinal leukotriene B4 receptor. Cloning and functional characterization. J Biol Chem 275:40686-94 (2000)  
Target
Name:
Leukotriene B4 receptor 2
Synonyms:
BLT2R LT4R2_HUMAN LTB4-R 2 LTB4R2 Leukotriene B4 Leukotriene B4 receptor Leukotriene B4 receptor BLT2 Seven transmembrane receptor BLTR2
Type:
Enzyme Catalytic Domain
Mol. Mass.:
37964.86
Organism:
Homo sapiens (Human)
Description:
Leukotriene 2 0 HUMAN::Q9NPC1
Residue:
358
  
Inhibitor
Name:
BDBM50297387
Synonyms:
(5S,6R,7E,9E,11Z,14Z)-6-(cystein-S-yl)-5-hydroxyicosa-7,9,11,14-tetraenoic acidS-{(1R,2E,4E,6Z,9Z)-1-[(1S)-4-carboxy-1-hydroxybutyl]pentadeca-2,4,6,9-tetraen-1-yl}-L-cysteine 5S-hydroxy,6R-(S-cysteinyl),7E,9E,11Z,14Z-eicosatetraenoic acid LTE4 | leukotriene E4
Type:
Small organic molecule
Emp. Form.:
C23H37NO5S
Mol. Mass.:
439.609
SMILES:
CCCCC\C=C/C\C=C/C=C/C=C/[C@@H](SC[C@H](N)C(O)=O)[C@@H](O)CCCC(O)=O
: