Target
Metabotropic glutamate receptor 5
Ligand
BDBM50053589
Substrate
Ki
8400±n/a nM
Comments
PDSP_3334
Citation
 Mutel, VEllis, GJAdam, GChaboz, SNilly, AMesser, JBleuel, ZMetzler, VMalherbe, PSchlaeger, EJRoughley, BSFaull, RLRichards, JG Characterization of [(3)H]Quisqualate binding to recombinant rat metabotropic glutamate 1a and 5a receptors and to rat and human brain sections. J Neurochem 75:2590-601 (2000)  
Target
Name:
Metabotropic glutamate receptor 5
Synonyms:
GPRC1E GRM5_HUMAN metabotropic glutamate 5 | metabotropic glutamate 5a
Type:
Enzyme
Mol. Mass.:
132484.72
Organism:
Homo sapiens (Human)
Description:
Residue:
1212
  
Inhibitor
Name:
BDBM50053589
Synonyms:
(S)-3-Hydroxyphenylglycine 3HPG | CHEMBL442347
Type:
Small organic molecule
Emp. Form.:
C8H9NO3
Mol. Mass.:
167.162
SMILES:
N[C@H](C(O)=O)c1cccc(O)c1
: