Target
Alpha-1A adrenergic receptor
Ligand
BDBM85709
Substrate
Ki
6.3096±n/a nM
Comments
PDSP_3303
Citation
 Millan, MJDekeyne, ANewman-Tancredi, ACussac, DAudinot, VMilligan, GDuqueyroix, DGirardon, SMullot, JBoutin, JANicolas, JPRenouard-Try, ALacoste, JMCordi, A S18616, a highly potent, spiroimidazoline agonist at alpha(2)-adrenoceptors: I. Receptor profile, antinociceptive and hypothermic actions in comparison with dexmedetomidine and clonidine. J Pharmacol Exp Ther 295:1192-205 (2000) Target
Name:
Alpha-1A adrenergic receptor
Synonyms:
ADA1A_RAT Adra1c Alpha-1A adrenoceptor Alpha-1C adrenergic receptor | adrenergic Alpha1A
Type:
Protein
Mol. Mass.:
51620.15
Organism:
Rattus norvegicus (Rat)
Description:
P43140
Residue:
466
  
Inhibitor
Name:
BDBM85709
Synonyms:
S18616
Type:
Small organic molecule
Emp. Form.:
C12H14N2O
Mol. Mass.:
202.2524
SMILES:
NC1=NC2(CO1)CCc1ccccc1C2
: