Target
Prostaglandin G/H synthase 1
Ligand
BDBM13063
Substrate
Ki
250±n/a nM
Comments
PDSP_4001
Citation
 Riendeau, DPercival, MDBrideau, CCharleson, SDubé, DEthier, DFalgueyret, JPFriesen, RWGordon, RGreig, GGuay, JMancini, JOuellet, MWong, EXu, LBoyce, SVisco, DGirard, YPrasit, PZamboni, RRodger, IWGresser, MFord-Hutchinson, AWYoung, RNChan, CC Etoricoxib (MK-0663): preclinical profile and comparison with other agents that selectively inhibit cyclooxygenase-2. J Pharmacol Exp Ther 296:558-66 (2001) Target
Name:
Prostaglandin G/H synthase 1
Synonyms:
COX-1 Cyclooxygenase Cyclooxygenase-1 (COX-1) PTGS1 | Prostaglandin G/H synthase (cyclooxygenase)
Type:
Enzyme
Mol. Mass.:
68692.62
Organism:
Homo sapiens (Human)
Description:
P23219
Residue:
599
  
Inhibitor
Name:
BDBM13063
Synonyms:
4-(5-methyl-3-phenyl-1,2-oxazol-4-yl)benzene-1-sulfonamide CHEMBL865 Valdecoxib | cid_119607
Type:
Small organic molecule
Emp. Form.:
C16H14N2O3S
Mol. Mass.:
314.359
SMILES:
Cc1onc(c1-c1ccc(cc1)S(N)(=O)=O)-c1ccccc1
: