Target
Tyrosinase
Ligand
BDBM50031467
Substrate
Meas. Tech.
Inhibition Assay
pH
6.8±0
Temperature
310.15±0 K
IC50
1.667e+4± 519.0 nM
Citation
 Khan, KMSaify, ZSKhan, MTButt, NMaharvi, GMPerveen, SAmbreen, NChoudhary, MIAtta-Ur-Rahman, ASupuran, CT Tyrosinase inhibition: conformational analysis based studies on molecular dynamics calculations of bipiperidine based inhibitors. J Enzyme Inhib Med Chem 20:401-7 (2005)  
Target
Name:
Tyrosinase
Synonyms:
LB24-AB SK29-AB TYRO_HUMAN | Tumor rejection antigen AB
Type:
Protein
Mol. Mass.:
60388.08
Organism:
Homo sapiens (Human)
Description:
P14679
Residue:
529
  
Inhibitor
Name:
BDBM50031467
Synonyms:
5-HYDROXY-2-(HYDROXYMETHYL)-4H-PYRAN-4-ONE CHEMBL287556 US10857082, Kojic acid US9682910, kojic acid
Type:
Small organic molecule
Emp. Form.:
C6H6O4
Mol. Mass.:
142.1094
SMILES:
OCc1cc(=O)c(O)co1
: