Target
Alpha-2C adrenergic receptor
Ligand
BDBM35234
Substrate
Ki
45±n/a nM
Comments
PDSP_1348
Citation
 Bylund, DBGerety, MEHappe, HKMurrin, LC A robust GTP-induced shift in alpha(2)-adrenoceptor agonist affinity in tissue sections from rat brain. J Neurosci Methods 105:159-66 (2001)  
Target
Name:
Alpha-2C adrenergic receptor
Synonyms:
ADA2C_RAT Adrenergic receptor alpha adrenergic Alpha2 | adrenergic Alpha2C
Type:
Enzyme Catalytic Domain
Mol. Mass.:
49890.50
Organism:
RAT
Description:
adrenergic Alpha2 0 RAT::P22086
Residue:
458
  
Inhibitor
Name:
BDBM35234
Synonyms:
DL-[7-3H]norepinephrine Noradrenaline,(+) | [3H]NE
Type:
radiolabeled ligand
Emp. Form.:
C8H11NO3
Mol. Mass.:
169.1778
SMILES:
NCC(O)c1ccc(O)c(O)c1
: