Target
Glutamate receptor 3
Ligand
BDBM50327886
Substrate
Ki
>10000±n/a nM
Comments
PDSP_2031
Citation
 Wright, RAArnold, MBWheeler, WJOrnstein, PLSchoepp, DD [3H]LY341495 binding to group II metabotropic glutamate receptors in rat brain. J Pharmacol Exp Ther 298:453-60 (2001) Target
Name:
Glutamate receptor 3
Synonyms:
GRIA3_RAT Glutamate receptor 3 Glutamate-AMPA | Gria3
Type:
Enzyme Catalytic Domain
Mol. Mass.:
100383.57
Organism:
RAT
Description:
Glutamate-AMPA GRIA3 RAT::P19492
Residue:
888
  
Inhibitor
Name:
BDBM50327886
Synonyms:
(1R,2S,5S,6S)-3-azabicyclo[3.1.0]hexane-2,6-dicarboxylic acid CHEMBL1256243
Type:
Small organic molecule
Emp. Form.:
C7H9NO4
Mol. Mass.:
171.1507
SMILES:
OC(=O)[C@H]1[C@H]2CN[C@@H]([C@@H]12)C(O)=O
: