Target
Glutamate receptor 3
Ligand
BDBM85077
Substrate
Ki
>10000±n/a nM
Comments
PDSP_2027
Citation
 Wright, RAArnold, MBWheeler, WJOrnstein, PLSchoepp, DD [3H]LY341495 binding to group II metabotropic glutamate receptors in rat brain. J Pharmacol Exp Ther 298:453-60 (2001) Target
Name:
Glutamate receptor 3
Synonyms:
GRIA3_RAT Glutamate receptor 3 Glutamate-AMPA | Gria3
Type:
Enzyme Catalytic Domain
Mol. Mass.:
100383.57
Organism:
RAT
Description:
Glutamate-AMPA GRIA3 RAT::P19492
Residue:
888
  
Inhibitor
Name:
BDBM85077
Synonyms:
3-Phosphono-D,L-2-aminopropionic acid, 7 L-AP3 | NSC_3857
Type:
Small organic molecule
Emp. Form.:
C3H8NO5P
Mol. Mass.:
169.0731
SMILES:
NC(CP(O)(O)=O)C(O)=O
: