Target
Sodium channel protein type 1 subunit alpha
Ligand
BDBM82071
Substrate
Ki
1000±n/a nM
Comments
PDSP_1947
Citation
 Bymaster, FPDreshfield-Ahmad, LJThrelkeld, PGShaw, JLThompson, LNelson, DLHemrick-Luecke, SKWong, DT Comparative affinity of duloxetine and venlafaxine for serotonin and norepinephrine transporters in vitro and in vivo, human serotonin receptor subtypes, and other neuronal receptors. Neuropsychopharmacology 25:871-80 (2001)  
Target
Name:
Sodium channel protein type 1 subunit alpha
Synonyms:
SCN1A_RAT Sodium (Site 1) Sodium channel protein type I alpha subunit Sodium channel protein, brain I subunit alpha Voltage-gated sodium channel subunit alpha Nav1.1
Type:
PROTEIN
Mol. Mass.:
228753.20
Organism:
Rattus norvegicus
Description:
ChEMBL_938840
Residue:
2009
  
Inhibitor
Name:
BDBM82071
Synonyms:
CAS_93413-69-5 NSC_62923 Venlafaxine hydrochloride WY-45655
Type:
Small organic molecule
Emp. Form.:
C17H27NO2
Mol. Mass.:
277.4018
SMILES:
COc1ccc(cc1)C(CN(C)C)C1(O)CCCCC1
: