Target
Mu-type opioid receptor
Ligand
BDBM50034043
Substrate
Ki
>10000±n/a nM
Comments
PDSP_964
Citation
 Kalkman, HOSubramanian, NHoyer, D Extended radioligand binding profile of iloperidone: a broad spectrum dopamine/serotonin/norepinephrine receptor antagonist for the management of psychotic disorders. Neuropsychopharmacology 25:904-14 (2001)  
Target
Name:
Mu-type opioid receptor
Synonyms:
M-OR-1 MOR-1 MUOR1 Mu opiate receptor OPRM1 hMOP | mu-type opioid receptor isoform MOR-1
Type:
G Protein-Coupled Receptor (GPCR)
Mol. Mass.:
44789.51
Organism:
Homo sapiens (Human)
Description:
P35372
Residue:
400
  
Inhibitor
Name:
BDBM50034043
Synonyms:
1-(4-{3-[4-(6-Fluoro-benzo[d]isoxazol-3-yl)-piperidin-1-yl]-propoxy}-3-methoxy-phenyl)-ethanone ILOPERIDONE
Type:
Small organic molecule
Emp. Form.:
C24H27FN2O4
Mol. Mass.:
426.4806
SMILES:
COc1cc(ccc1OCCCN1CCC(CC1)c1noc2cc(F)ccc12)C(C)=O
: