Target
Orexin/Hypocretin receptor type 1
Ligand
BDBM164112
Substrate
Meas. Tech.
Radioligand Binding Assay
Temperature
277.15±n/a K
Ki
41±n/a nM
Comments
extracted
Citation
 Coate, HRDvorak, CALebold, TPPreville, CShireman, BT Substituted 7-azabicycles and their use as orexin receptor modulators US Patent  US9695183 Publication Date 7/4/2017 
Target
Name:
Orexin/Hypocretin receptor type 1
Synonyms:
HCRTR1 OX1R_HUMAN Orexin receptor type 1 (OR 1) Orexin receptor type 1 (OX1) Orexin receptor type 1 (OxR1) | Ox1r
Type:
Protein
Mol. Mass.:
47554.50
Organism:
Homo sapiens (Human)
Description:
O43613
Residue:
425
  
Inhibitor
Name:
BDBM164112
Synonyms:
US9062078, 242 US9637496, 242 | US9695183, 242
Type:
Small organic molecule
Emp. Form.:
C21H20F3N7O2
Mol. Mass.:
459.4244
SMILES:
COc1cccc(c1C(=O)N1C2CCC1C(C2)Nc1cnc(cn1)C(F)(F)F)-n1nccn1
: