Target
Beta-1 adrenergic receptor
Ligand
BDBM86194
Substrate
Ki
>10000±n/a nM
Comments
PDSP_2977
Citation
 Shi, QSavage, JEHufeisen, SJRauser, LGrajkowska, EErnsberger, PWroblewski, JTNadeau, JHRoth, BL L-homocysteine sulfinic acid and other acidic homocysteine derivatives are potent and selective metabotropic glutamate receptor agonists. J Pharmacol Exp Ther 305:131-42 (2003)  
Target
Name:
Beta-1 adrenergic receptor
Synonyms:
ADRB1R, B1AR Adrb1 Adrenergic receptor beta Beta-1 adrenoreceptor adrenergic Beta1,2
Type:
Protein
Mol. Mass.:
50486.84
Organism:
Rattus norvegicus (Rat)
Description:
P18090
Residue:
466
  
Inhibitor
Name:
BDBM86194
Synonyms:
CAS_109 NSC_109
Type:
Small organic molecule
Emp. Form.:
C3H7NO4S
Mol. Mass.:
153.157
SMILES:
NC(CS(O)=O)C(O)=O
: