Target
D(2) dopamine receptor
Ligand
BDBM86194
Substrate
Ki
>10000±n/a nM
Comments
PDSP_2977
Citation
 Shi, QSavage, JEHufeisen, SJRauser, LGrajkowska, EErnsberger, PWroblewski, JTNadeau, JHRoth, BL L-homocysteine sulfinic acid and other acidic homocysteine derivatives are potent and selective metabotropic glutamate receptor agonists. J Pharmacol Exp Ther 305:131-42 (2003)  
Target
Name:
D(2) dopamine receptor
Synonyms:
D(2) dopamine receptor DOPAMINE D2 Long DRD2 Dopamine D2 receptor Dopamine D2 receptor (D2R) Dopamine2-like | d2
Type:
Cell-surface receptors
Mol. Mass.:
50647.10
Organism:
Homo sapiens (Human)
Description:
P14416
Residue:
443
  
Inhibitor
Name:
BDBM86194
Synonyms:
CAS_109 NSC_109
Type:
Small organic molecule
Emp. Form.:
C3H7NO4S
Mol. Mass.:
153.157
SMILES:
NC(CS(O)=O)C(O)=O
: