Target
D(1B) dopamine receptor
Ligand
BDBM86194
Substrate
Ki
>10000±n/a nM
Comments
PDSP_2977
Citation
 Shi, QSavage, JEHufeisen, SJRauser, LGrajkowska, EErnsberger, PWroblewski, JTNadeau, JHRoth, BL L-homocysteine sulfinic acid and other acidic homocysteine derivatives are potent and selective metabotropic glutamate receptor agonists. J Pharmacol Exp Ther 305:131-42 (2003)  
Target
Name:
D(1B) dopamine receptor
Synonyms:
D(5) dopamine receptor DOPAMINE D5 DRD1L2 DRD5_HUMAN | dopamine receptor D5
Type:
Protein
Mol. Mass.:
52943.41
Organism:
Homo sapiens (Human)
Description:
P21918
Residue:
477
  
Inhibitor
Name:
BDBM86194
Synonyms:
CAS_109 NSC_109
Type:
Small organic molecule
Emp. Form.:
C3H7NO4S
Mol. Mass.:
153.157
SMILES:
NC(CS(O)=O)C(O)=O
: