Target
Metabotropic glutamate receptor 1
Ligand
BDBM50030630
Substrate
Ki
98.3±n/a nM
Comments
PDSP_3105
Citation
 Lavreysen, HJanssen, CBischoff, FLanglois, XLeysen, JELesage, AS [3H]R214127: a novel high-affinity radioligand for the mGlu1 receptor reveals a common binding site shared by multiple allosteric antagonists. Mol Pharmacol 63:1082-93 (2003)  
Target
Name:
Metabotropic glutamate receptor 1
Synonyms:
GRM1_RAT Grm1 Metabotropic glutamate receptor Mglur1 metabotropic glutamate 1/5-D metabotropic glutamate receptor 1 isoform alpha precursor
Type:
Enzyme Catalytic Domain
Mol. Mass.:
133240.47
Organism:
RAT
Description:
metabotropic glutamate 1/2 0 RAT::P23385
Residue:
1199
  
Inhibitor
Name:
BDBM50030630
Synonyms:
(RS)-1-aminoindan-1,5-dicarboxylic acid 1-Amino-indan-1,5-dicarboxylic acid(RS-AIDA) AIDC GNF-Pf-1401
Type:
Small organic molecule
Emp. Form.:
C11H11NO4
Mol. Mass.:
221.2093
SMILES:
NC1(CCc2cc(ccc12)C(O)=O)C(O)=O
: