Target
fMet-Leu-Phe receptor
Ligand
BDBM86302
Substrate
Ki
99±n/a nM
Comments
PDSP_3273
Citation
 Bae, YSSong, JYKim, YHe, RYe, RDKwak, JYSuh, PGRyu, SH Differential activation of formyl peptide receptor signaling by peptide ligands. Mol Pharmacol 64:841-7 (2003)  
Target
Name:
fMet-Leu-Phe receptor
Synonyms:
FPR FPR1_HUMAN N-formyl peptide receptor 1 fMLP receptor formyl peptide receptor 1
Type:
Enzyme Catalytic Domain
Mol. Mass.:
38456.14
Organism:
Homo sapiens (Human)
Description:
gi_4503779
Residue:
350
  
Inhibitor
Name:
BDBM86302
Synonyms:
WDYMVm-NH2
Type:
Small organic molecule
Emp. Form.:
C39H54N8O9S2
Mol. Mass.:
843.024
SMILES:
CSCC[C@@H](NC(=O)[C@@H](NC(=O)[C@H](CCSC)NC(=O)[C@H](Cc1ccc(O)cc1)NC(=O)[C@@H](CC(O)=O)NC(=O)[C@@H](N)Cc1c[nH]c2ccccc12)C(C)C)C(N)=O
: