Target
Interleukin-8
Ligand
BDBM277681
Substrate
Meas. Tech.
PBMC Cell Assay
IC50
20.8±n/a nM
Citation
 Fyfe, MCThom, SM Kinase inhibitors US Patent  US10072034 Publication Date 9/11/2018 
Target
Name:
Interleukin-8
Synonyms:
CXCL8 IL8_HUMAN interleukin 8 precursor
Type:
PROTEIN
Mol. Mass.:
11104.05
Organism:
Homo sapiens (Human)
Description:
ChEMBL_577736
Residue:
99
  
Inhibitor
Name:
BDBM277681
Synonyms:
2-(2-(2-(3-(4-((4-(3-(5-(tert-Butyl)-2-methoxy-3-(methylcarbamoyl)phenyl)ureido) naphthalen-1-yl)oxy)pyridin-2-yl)amino)-5-methoxyphenoxy)ethoxy)ethoxy)acetic acid | US10072034, Example 7
Type:
Small organic molecule
Emp. Form.:
C42H47N5O10
Mol. Mass.:
781.8501
SMILES:
CNC(=O)c1cc(cc(NC(=O)Nc2ccc(Oc3ccnc(Nc4cc(OC)cc(OCCOCCOCC(O)=O)c4)c3)c3ccccc23)c1OC)C(C)(C)C
: