Target
Interleukin-8
Ligand
BDBM277684
Substrate
Meas. Tech.
PBMC Cell Assay
IC50
26.5±n/a nM
Citation
 Fyfe, MCThom, SM Kinase inhibitors US Patent  US10072034 Publication Date 9/11/2018 
Target
Name:
Interleukin-8
Synonyms:
CXCL8 IL8_HUMAN interleukin 8 precursor
Type:
PROTEIN
Mol. Mass.:
11104.05
Organism:
Homo sapiens (Human)
Description:
ChEMBL_577736
Residue:
99
  
Inhibitor
Name:
BDBM277684
Synonyms:
2-(2-(2-(3-((4-((4-(3-(5-(tert-Butyl)-3-(dimethylphosphoryl)-2-methoxyphenyl)ureido)-naphthalen-1-yl)oxy)pyridin-2-yl)amino)-5-methoxyphenoxy)ethoxy)ethoxy)acetic acid | US10072034, Example 10
Type:
Small organic molecule
Emp. Form.:
C42H49N4O10P
Mol. Mass.:
800.833
SMILES:
COc1cc(Nc2cc(Oc3ccc(NC(=O)Nc4cc(cc(c4OC)P(C)(C)=O)C(C)(C)C)c4ccccc34)ccn2)cc(OCCOCCOCC(O)=O)c1
: