Target
Interleukin-8
Ligand
BDBM277691
Substrate
Meas. Tech.
PBMC Cell Assay
IC50
17.2±n/a nM
Citation
 Fyfe, MCThom, SM Kinase inhibitors US Patent  US10072034 Publication Date 9/11/2018 
Target
Name:
Interleukin-8
Synonyms:
CXCL8 IL8_HUMAN interleukin 8 precursor
Type:
PROTEIN
Mol. Mass.:
11104.05
Organism:
Homo sapiens (Human)
Description:
ChEMBL_577736
Residue:
99
  
Inhibitor
Name:
BDBM277691
Synonyms:
2-(2-(2-(3-((4-((4-(3-(5-(tert-Butyl) isoxazol-3-yl)ureido)naphthalen-1-yl)oxy)pyridin-2-yl)amino)-5-methoxyphenoxy)ethoxy)ethoxy)acetic acid | US10072034, Example 17
Type:
Small organic molecule
Emp. Form.:
C36H39N5O9
Mol. Mass.:
685.723
SMILES:
COc1cc(Nc2cc(Oc3ccc(NC(=O)Nc4cc(on4)C(C)(C)C)c4ccccc34)ccn2)cc(OCCOCCOCC(O)=O)c1
: