Target
Interleukin-8
Ligand
BDBM277692
Substrate
Meas. Tech.
PBMC Cell Assay
IC50
29.3±n/a nM
Citation
 Fyfe, MCThom, SM Kinase inhibitors US Patent  US10072034 Publication Date 9/11/2018 
Target
Name:
Interleukin-8
Synonyms:
CXCL8 IL8_HUMAN interleukin 8 precursor
Type:
PROTEIN
Mol. Mass.:
11104.05
Organism:
Homo sapiens (Human)
Description:
ChEMBL_577736
Residue:
99
  
Inhibitor
Name:
BDBM277692
Synonyms:
N-(5-(tert-Butl-2-methoxy-3-(3-(4-((2-((3-methoxy-5-(2-(2-((5-oxo-2,5-dihydroisoxazol-3-yl)methoxy)ethoxy)ethoxy)phenyl)amino)pyridin-4-yl)oxy)naphthalen-1-yl)ureido)phenyl)-methanesulfonamide | US10072034, Example 18
Type:
Small organic molecule
Emp. Form.:
C43H48N6O11S
Mol. Mass.:
856.94
SMILES:
COc1cc(Nc2cc(Oc3ccc(NC(=O)Nc4cc(cc(NS(C)(=O)=O)c4OC)C(C)(C)C)c4ccccc34)ccn2)cc(OCCOCCOCc2cc(=O)o[nH]2)c1
: