Target
Interleukin-8
Ligand
BDBM277694
Substrate
Meas. Tech.
PBMC Cell Assay
IC50
10.4±n/a nM
Citation
 Fyfe, MCThom, SM Kinase inhibitors US Patent  US10072034 Publication Date 9/11/2018 
Target
Name:
Interleukin-8
Synonyms:
CXCL8 IL8_HUMAN interleukin 8 precursor
Type:
PROTEIN
Mol. Mass.:
11104.05
Organism:
Homo sapiens (Human)
Description:
ChEMBL_577736
Residue:
99
  
Inhibitor
Name:
BDBM277694
Synonyms:
US10072034, Example 20(a) | US10072034, Example 20(b)
Type:
Small organic molecule
Emp. Form.:
C42H49N5O11S
Mol. Mass.:
831.93
SMILES:
COc1cc(Nc2cc(Oc3ccc(NC(=O)Nc4cc(cc(NS(C)(=O)=O)c4OC)C(C)(C)C)c4ccccc34)ccn2)cc(OCCOCCOC(C)C(O)=O)c1
: