Target
Interleukin-8
Ligand
BDBM277703
Substrate
Meas. Tech.
PBMC Cell Assay
IC50
20.6±n/a nM
Citation
 Fyfe, MCThom, SM Kinase inhibitors US Patent  US10072034 Publication Date 9/11/2018 
Target
Name:
Interleukin-8
Synonyms:
CXCL8 IL8_HUMAN interleukin 8 precursor
Type:
PROTEIN
Mol. Mass.:
11104.05
Organism:
Homo sapiens (Human)
Description:
ChEMBL_577736
Residue:
99
  
Inhibitor
Name:
BDBM277703
Synonyms:
2-(2-(2-(3-((4-((4-(3-(5-(tert-Butyl)-2-methoxy-3-(methylsulfonamido)phenyl)ureido)-naphthalen-1-yl-oxy)pyridin-2-yl)amino)-5-(difluoromethoxy)phenoxy)ethoxy)ethoxy)acetic acid | US10072034, Example 28
Type:
Small organic molecule
Emp. Form.:
C41H45F2N5O11S
Mol. Mass.:
853.885
SMILES:
COc1c(NC(=O)Nc2ccc(Oc3ccnc(Nc4cc(OCCOCCOCC(O)=O)cc(OC(F)F)c4)c3)c3ccccc23)cc(cc1NS(C)(=O)=O)C(C)(C)C
: