Target
Polycystin-1
Ligand
BDBM86434
Substrate
Ki
0.35±n/a nM
Comments
PDSP_3222
Citation
 Wang, QJFang, TWYang, DLewin, NEVan Lint, JMarquez, VEBlumberg, PM Ligand structure-activity requirements and phospholipid dependence for the binding of phorbol esters to protein kinase D. Mol Pharmacol 64:1342-8 (2003)  
Target
Name:
Polycystin-1
Synonyms:
PKD1 Protein Kinase D-GST
Type:
Enzyme Catalytic Domain
Mol. Mass.:
462537.85
Organism:
Homo sapiens (Human)
Description:
Protein Kinase D-GST 0 HUMAN::P98161
Residue:
4303
  
Inhibitor
Name:
BDBM86434
Synonyms:
12-Deoxyphorbol 13-phenylacetate NSC_105100
Type:
Small organic molecule
Emp. Form.:
C28H34O6
Mol. Mass.:
466.566
SMILES:
CC1CC2(OC(=O)Cc3ccccc3)C(C3C=C(CO)CC4(O)C(C=C(C)C4=O)C13O)C2(C)C
: