Target
Hrh3 protein
Ligand
BDBM27213
Substrate
Ki
0.427±n/a nM
Comments
PDSP_2989
Citation
 Hancock, AABennani, YLBush, ENEsbenshade, TAFaghih, RFox, GBJacobson, PKnourek-Segel, VKrueger, KMNuss, MEPan, JBShapiro, RWitte, DGYao, BB Antiobesity effects of A-331440, a novel non-imidazole histamine H3 receptor antagonist. Eur J Pharmacol 487:183-97 (2004)  
Target
Name:
Hrh3 protein
Synonyms:
HISTAMINE H3 Hrh3 protein
Type:
Enzyme Catalytic Domain
Mol. Mass.:
37860.96
Organism:
RAT
Description:
Q5PPG3
Residue:
344
  
Inhibitor
Name:
BDBM27213
Synonyms:
4-[3-(4-cyclopropanecarbonylphenoxy)propyl]-1H-imidazole CHEMBL1795025 | Ciproxifan
Type:
Small organic molecule
Emp. Form.:
C16H18N2O2
Mol. Mass.:
270.3263
SMILES:
O=C(C1CC1)c1ccc(OCCCc2cnc[nH]2)cc1
: