Target
5-hydroxytryptamine receptor 2A
Ligand
BDBM50249134
Substrate
Ki
933.25±n/a nM
Comments
PDSP_3873
Citation
 Knight, ARMisra, AQuirk, KBenwell, KRevell, DKennett, GBickerdike, M Pharmacological characterisation of the agonist radioligand binding site of 5-HT(2A), 5-HT(2B) and 5-HT(2C) receptors. Naunyn Schmiedebergs Arch Pharmacol 370:114-23 (2004)  
Target
Name:
5-hydroxytryptamine receptor 2A
Synonyms:
5-HT-2 5-HT2A 5-hydroxytryptamine receptor 2A (5HT-2A) 5HT2A_HUMAN HTR2A | Serotonin receptor 2A
Type:
undefined
Mol. Mass.:
52607.65
Organism:
Homo sapiens (Human)
Description:
P28223
Residue:
471
  
Inhibitor
Name:
BDBM50249134
Synonyms:
4-(4-fluoronaphthalen-1-yl)-6-isopropylpyrimidin-2-amine RS-127445
Type:
Small organic molecule
Emp. Form.:
C17H16FN3
Mol. Mass.:
281.3274
SMILES:
CC(C)c1cc(nc(N)n1)-c1ccc(F)c2ccccc12
: