Target
Delta-type opioid receptor
Ligand
BDBM86667
Substrate
Ki
0.11±n/a nM
Comments
PDSP_4768
Citation
 Tryoen-Tóth, PDécaillot, FMFilliol, DBefort, KLazarus, LHSchiller, PWSchmidhammer, HKieffer, BL Inverse agonism and neutral antagonism at wild-type and constitutively active mutant delta opioid receptors. J Pharmacol Exp Ther 313:410-21 (2005)  
Target
Name:
Delta-type opioid receptor
Synonyms:
D-OR-1 Delta opioid receptor OPIATE Delta OPRD1 OPRK1 | opioid receptor, delta 1
Type:
G Protein-Coupled Receptor (GPCR)
Mol. Mass.:
40382.98
Organism:
Homo sapiens (Human)
Description:
Competition binding assays were carried out using membrane preparations from transfected HN9.10 cells that constitutively expressed the delta opioid receptor.
Residue:
372
  
Inhibitor
Name:
BDBM86667
Synonyms:
HS464
Type:
Small organic molecule
Emp. Form.:
C28H29N2O3
Mol. Mass.:
441.5415
SMILES:
CCO[C@]12Cc3c(nc4ccccc34)C3Oc4c5c(CC1N(CC1CC1)CCC235)ccc4O
: