Target
5-hydroxytryptamine receptor 1E
Ligand
BDBM50232153
Substrate
Ki
>10000±n/a nM
Comments
PDSP_1172
Citation
 Pehek, EANocjar, CRoth, BLByrd, TAMabrouk, OS Evidence for the preferential involvement of 5-HT2A serotonin receptors in stress- and drug-induced dopamine release in the rat medial prefrontal cortex. Neuropsychopharmacology 31:265-77 (2006)  
Target
Name:
5-hydroxytryptamine receptor 1E
Synonyms:
5-HT-1E 5-Hydroxytryptamine Receptor Subtype 1E (5HT1E) 5-hydroxytryptamine receptor 1E (5-HT-1E) (S31) 5HT1E_HUMAN S31 Serotonin 1e (5-HT1e) receptor | Serotonin Receptor 1E
Type:
G Protein-Coupled Receptor (GPCR)
Mol. Mass.:
41697.80
Organism:
Homo sapiens (Human)
Description:
gi_112822
Residue:
365
  
Inhibitor
Name:
BDBM50232153
Synonyms:
(1-(4-fluorophenethyl)piperidin-4-yl)(2,3-dimethoxyphenyl)methanol CHEMBL257283 MDL-100907
Type:
Small organic molecule
Emp. Form.:
C22H28FNO3
Mol. Mass.:
373.461
SMILES:
COc1cccc(C(O)C2CCN(CCc3ccc(F)cc3)CC2)c1OC
: