Target
Alpha-2A adrenergic receptor
Ligand
BDBM50232153
Substrate
Ki
1900±n/a nM
Comments
PDSP_1172
Citation
 Pehek, EANocjar, CRoth, BLByrd, TAMabrouk, OS Evidence for the preferential involvement of 5-HT2A serotonin receptors in stress- and drug-induced dopamine release in the rat medial prefrontal cortex. Neuropsychopharmacology 31:265-77 (2006)  
Target
Name:
Alpha-2A adrenergic receptor
Synonyms:
ADA2A_HUMAN ADRA2R Adrenergic alpha2A Alpha-2 adrenergic receptor subtype C10 Alpha-2A adrenoreceptor alpha-2A adrenergic receptor [Homo sapiens]
Type:
Enzyme
Mol. Mass.:
48979.91
Organism:
Homo sapiens (Human)
Description:
P08913
Residue:
465
  
Inhibitor
Name:
BDBM50232153
Synonyms:
(1-(4-fluorophenethyl)piperidin-4-yl)(2,3-dimethoxyphenyl)methanol CHEMBL257283 MDL-100907
Type:
Small organic molecule
Emp. Form.:
C22H28FNO3
Mol. Mass.:
373.461
SMILES:
COc1cccc(C(O)C2CCN(CCc3ccc(F)cc3)CC2)c1OC
: