Target
1-phosphatidylinositol 4,5-bisphosphate phosphodiesterase beta-1
Ligand
BDBM86730
Substrate
Ki
5000±n/a nM
Comments
PDSP_6129
Citation
 Braverman, ASTibb, ASRuggieri, MR M2 and M3 muscarinic receptor activation of urinary bladder contractile signal transduction. I. Normal rat bladder. J Pharmacol Exp Ther 316:869-74 (2006)  
Target
Name:
1-phosphatidylinositol 4,5-bisphosphate phosphodiesterase beta-1
Synonyms:
1-phosphatidylinositol-4,5-bisphosphate phosphodiesterase beta-1 Phosphoinositide specific phospholipase C, PI-PLC | Plcb1
Type:
Enzyme Catalytic Domain
Mol. Mass.:
138335.84
Organism:
RAT
Description:
P10687
Residue:
1216
  
Inhibitor
Name:
BDBM86730
Synonyms:
CAS_77286-66-9 | ET-18-OCH3
Type:
Small organic molecule
Emp. Form.:
C27H58NO6P
Mol. Mass.:
523.7263
SMILES:
[C@H](COP([O-])(=O)OCC[N+](C)(C)C)OC
: