Target
Mu-type opioid receptor
Ligand
BDBM86947
Substrate
Ki
0.21±n/a nM
Comments
PDSP_8456
Citation
 Ghirmai, SAzar, MRPolgar, WEBerzetei-Gurske, ICashman, JR Synthesis and biological evaluation of alpha- and beta-6-amido derivatives of 17-cyclopropylmethyl-3, 14beta-dihydroxy-4, 5alpha-epoxymorphinan: potential alcohol-cessation agents. J Med Chem 51:1913-24 (2008)  
Target
Name:
Mu-type opioid receptor
Synonyms:
M-OR-1 MOR-1 MUOR1 Mu opiate receptor OPRM1 hMOP | mu-type opioid receptor isoform MOR-1
Type:
G Protein-Coupled Receptor (GPCR)
Mol. Mass.:
44789.51
Organism:
Homo sapiens (Human)
Description:
P35372
Residue:
400
  
Inhibitor
Name:
BDBM86947
Synonyms:
17-cyclopropylmethyl-3,14-beta-dihydroxy-4,5-alpha-epoxy-6-beta-[(4'-carbomethoxy)benzamido]morphinan NSC_24822634
Type:
Small organic molecule
Emp. Form.:
C29H32N2O6
Mol. Mass.:
504.5742
SMILES:
COC(=O)c1ccc(cc1)C(=O)NC1CCC2(O)C3Cc4ccc(O)c5OC1C2(CCN3CC1CC1)c45
: