Target
Cannabinoid receptor 1
Ligand
BDBM87020
Substrate
Ki
243.8±n/a nM
Comments
PDSP_8607
Citation
 Wang, HDuffy, RABoykow, GCChackalamannil, SMadison, VS Identification of novel cannabinoid CB1 receptor antagonists by using virtual screening with a pharmacophore model. J Med Chem 51:2439-46 (2008)  
Target
Name:
Cannabinoid receptor 1
Synonyms:
CANN6 CB-R CNR CNR1_HUMAN Cannabinoid receptor Cannabinoid receptor 1 (brain)
Type:
G Protein-Coupled Receptor (GPCR)
Mol. Mass.:
52868.96
Organism:
Homo sapiens (Human)
Description:
P21554
Residue:
472
  
Inhibitor
Name:
BDBM87020
Synonyms:
(3R,4S)-4-(4-methoxyphenyl)-1-phenyl-3-(3-(pyridin-3-yl)propyl)azetidin-2-one NSC_15481172
Type:
Small organic molecule
Emp. Form.:
C24H24N2O2
Mol. Mass.:
372.4596
SMILES:
COc1ccc(cc1)C1C(CCCc2cccnc2)C(=O)N1c1ccccc1
: