Target
GTP-binding nuclear protein GSP1/CNR1
Ligand
BDBM87015
Substrate
Ki
100±n/a nM
Comments
PDSP_8600
Citation
 Wang, HDuffy, RABoykow, GCChackalamannil, SMadison, VS Identification of novel cannabinoid CB1 receptor antagonists by using virtual screening with a pharmacophore model. J Med Chem 51:2439-46 (2008)  
Target
Name:
GTP-binding nuclear protein GSP1/CNR1
Synonyms:
CANNABINOID CB1 CST17 GSP1_YEAST | GTP-binding nuclear protein GSP1/CNR1
Type:
Enzyme Catalytic Domain
Mol. Mass.:
24810.06
Organism:
Saccharomyces cerevisiae
Description:
CANNABINOID CB1 CNR1 0::P32835
Residue:
219
  
Inhibitor
Name:
BDBM87015
Synonyms:
1-(bis(4-chlorophenyl)methyl)-3-((3,5-difluorophenyl)(methylsulfonyl)methylene)azetidine NSC_9810861
Type:
Small organic molecule
Emp. Form.:
C24H19Cl2F2NO2S
Mol. Mass.:
494.381
SMILES:
[#6]S(=O)(=O)[#6](=[#6]-1/[#6]-[#7](-[#6]-1)-[#6](-c1ccc(Cl)cc1)-c1ccc(Cl)cc1)\c1cc(F)cc(F)c1
: