Target
GTP-binding nuclear protein GSP1/CNR1
Ligand
BDBM50176988
Substrate
Ki
0.00035±n/a nM
Comments
PDSP_8602
Citation
 Wang, HDuffy, RABoykow, GCChackalamannil, SMadison, VS Identification of novel cannabinoid CB1 receptor antagonists by using virtual screening with a pharmacophore model. J Med Chem 51:2439-46 (2008)  
Target
Name:
GTP-binding nuclear protein GSP1/CNR1
Synonyms:
CANNABINOID CB1 CST17 GSP1_YEAST | GTP-binding nuclear protein GSP1/CNR1
Type:
Enzyme Catalytic Domain
Mol. Mass.:
24810.06
Organism:
Saccharomyces cerevisiae
Description:
CANNABINOID CB1 CNR1 0::P32835
Residue:
219
  
Inhibitor
Name:
BDBM50176988
Synonyms:
8-Chloro-1-(2,4-dichloro-phenyl)-1,3a,4,5,6,10b-hexahydro-1,2-diaza-benzo[e]azulene-3-carboxylic acid piperidin-1-ylamide 8-chloro-1-(2',4'-dichlorophenyl)-N-piperidin-1-yl-1,4,5,6-tetrahydrobenzo[6,7]cyclohepta[1,2-c]pyrazole-3-carboxamide CHEMBL376700
Type:
Small organic molecule
Emp. Form.:
C24H23Cl3N4O
Mol. Mass.:
489.825
SMILES:
Clc1ccc(c(Cl)c1)-n1nc(C(=O)NN2CCCCC2)c2CCCc3cc(Cl)ccc3-c12
: