Target
Cannabinoid receptor 2
Ligand
BDBM87013
Substrate
Ki
194.2±n/a nM
Comments
PDSP_8603
Citation
 Wang, HDuffy, RABoykow, GCChackalamannil, SMadison, VS Identification of novel cannabinoid CB1 receptor antagonists by using virtual screening with a pharmacophore model. J Med Chem 51:2439-46 (2008)  
Target
Name:
Cannabinoid receptor 2
Synonyms:
CANNABINOID CB2 CB2 CB2B CNR2_HUMAN Cannabinoid CB2 receptor Cannabinoid receptor 2 (CB2R) | hCB2
Type:
G Protein-Coupled Receptor (GPCR)
Mol. Mass.:
39690.94
Organism:
Homo sapiens (Human)
Description:
P34972
Residue:
360
  
Inhibitor
Name:
BDBM87013
Synonyms:
(3R,4S)-3-(benzofuran-2-ylmethyl)-4-(4-methoxyphenyl)-1-phenylazetidin-2-one NSC_44450447
Type:
Small organic molecule
Emp. Form.:
C25H21NO3
Mol. Mass.:
383.4391
SMILES:
COc1ccc(cc1)C1C(Cc2cc3ccccc3o2)C(=O)N1c1ccccc1
: