Target
GTP-binding nuclear protein GSP2/CNR2
Ligand
BDBM87019
Substrate
Ki
2312±n/a nM
Comments
PDSP_8598
Citation
 Wang, HDuffy, RABoykow, GCChackalamannil, SMadison, VS Identification of novel cannabinoid CB1 receptor antagonists by using virtual screening with a pharmacophore model. J Med Chem 51:2439-46 (2008)  
Target
Name:
GTP-binding nuclear protein GSP2/CNR2
Synonyms:
CANNABINOID CB2 GSP2 GTP-binding nuclear protein GSP2/CNR2
Type:
Enzyme Catalytic Domain
Mol. Mass.:
24990.72
Organism:
Saccharomyces cerevisiae
Description:
CANNABINOID CB2 CNR2 0::P32836
Residue:
220
  
Inhibitor
Name:
BDBM87019
Synonyms:
1-(2,4-dichlorophenyl)-4-(hydroxymethyl)-N-(piperidin-1-yl)-5-(4-(pyridin-3-yl)phenyl)-1H-pyrazole-3-carboxamide NSC_10186399
Type:
Small organic molecule
Emp. Form.:
C27H25Cl2N5O2
Mol. Mass.:
522.426
SMILES:
OCc1c(nn(c1-c1ccc(cc1)-c1cccnc1)-c1ccc(Cl)cc1Cl)C(=O)NN1CCCCC1
: