Target
Cannabinoid receptor 2
Ligand
BDBM87016
Substrate
Ki
1242.8±n/a nM
Comments
PDSP_8606
Citation
 Wang, HDuffy, RABoykow, GCChackalamannil, SMadison, VS Identification of novel cannabinoid CB1 receptor antagonists by using virtual screening with a pharmacophore model. J Med Chem 51:2439-46 (2008)  
Target
Name:
Cannabinoid receptor 2
Synonyms:
CANNABINOID CB2 CB2 CB2B CNR2_HUMAN Cannabinoid CB2 receptor Cannabinoid receptor 2 (CB2R) | hCB2
Type:
G Protein-Coupled Receptor (GPCR)
Mol. Mass.:
39690.94
Organism:
Homo sapiens (Human)
Description:
P34972
Residue:
360
  
Inhibitor
Name:
BDBM87016
Synonyms:
4-(4-methoxyphenyl)-1-phenyl-3-(2-(phenylsulfonyl)ethyl)azetidin-2-one NSC_44450419
Type:
Small organic molecule
Emp. Form.:
C24H23NO4S
Mol. Mass.:
421.509
SMILES:
COc1ccc(cc1)C1C(CCS(=O)(=O)c2ccccc2)C(=O)N1c1ccccc1
: