Target
GTP-binding nuclear protein GSP2/CNR2
Ligand
BDBM21278
Substrate
Ki
1000±n/a nM
Comments
PDSP_7040
Citation
 Wang, HDuffy, RABoykow, GCChackalamannil, SMadison, VS Identification of novel cannabinoid CB1 receptor antagonists by using virtual screening with a pharmacophore model. J Med Chem 51:2439-46 (2008)  
Target
Name:
GTP-binding nuclear protein GSP2/CNR2
Synonyms:
CANNABINOID CB2 GSP2 GTP-binding nuclear protein GSP2/CNR2
Type:
Enzyme Catalytic Domain
Mol. Mass.:
24990.72
Organism:
Saccharomyces cerevisiae
Description:
CANNABINOID CB2 CNR2 0::P32836
Residue:
220
  
Inhibitor
Name:
BDBM21278
Synonyms:
5-(4-chlorophenyl)-1-(2,4-dichlorophenyl)-4-methyl-N-(piperidin-1-yl)-1H-pyrazole-3-carboxamide CHEMBL111 RIMONABANT HYDROCHLORIDE SR 141716A SR141716A [3H]SR141716A
Type:
Small organic molecule
Emp. Form.:
C22H21Cl3N4O
Mol. Mass.:
463.787
SMILES:
Cc1c(nn(c1-c1ccc(Cl)cc1)-c1ccc(Cl)cc1Cl)C(=O)NN1CCCCC1
: