Target
Cannabinoid receptor 2
Ligand
BDBM87017
Substrate
Ki
282±n/a nM
Comments
PDSP_8604
Citation
 Wang, HDuffy, RABoykow, GCChackalamannil, SMadison, VS Identification of novel cannabinoid CB1 receptor antagonists by using virtual screening with a pharmacophore model. J Med Chem 51:2439-46 (2008)  
Target
Name:
Cannabinoid receptor 2
Synonyms:
CANNABINOID CB2 CB2 CB2B CNR2_HUMAN Cannabinoid CB2 receptor Cannabinoid receptor 2 (CB2R) | hCB2
Type:
G Protein-Coupled Receptor (GPCR)
Mol. Mass.:
39690.94
Organism:
Homo sapiens (Human)
Description:
P34972
Residue:
360
  
Inhibitor
Name:
BDBM87017
Synonyms:
CAS_44450408 S-(R)-1-((2S,3R)-1-(4-fluorophenyl)-2-(4-hydroxyphenyl)-4-oxoazetidin-3-yl)-3-phenylpropyl ethanethioate
Type:
Small organic molecule
Emp. Form.:
C26H24FNO3S
Mol. Mass.:
449.537
SMILES:
CC(=O)SC(CCc1ccccc1)C1C(N(C1=O)c1ccc(F)cc1)c1ccc(O)cc1
: