Target
Sodium-dependent dopamine transporter
Ligand
BDBM87027
Substrate
Ki
2600±n/a nM
Comments
PDSP_8622
Citation
 Fish, PVDeur, CGan, XGreene, KHoople, DMackenny, MPara, KSReeves, KRyckmans, TStiff, CStobie, AWakenhut, FWhitlock, GA Design and synthesis of morpholine derivatives. SAR for dual serotonin & noradrenaline reuptake inhibition. Bioorg Med Chem Lett 18:2562-6 (2008)  
Target
Name:
Sodium-dependent dopamine transporter
Synonyms:
DA transporter DAT1 Dopamine transporter protein (DAT) SC6A3_HUMAN Sodium-dependent dopamine transporter Solute carrier family 6 member 3
Type:
Multi-pass membrane protein
Mol. Mass.:
68497.11
Organism:
Homo sapiens (Human)
Description:
Q01959
Residue:
620
  
Inhibitor
Name:
BDBM87027
Synonyms:
(R)-2-((R)-(2,3-difluorophenoxy)(phenyl)methyl)morpholine CAS_44450181 NSC_44450181 | NSC_44450185
Type:
Small organic molecule
Emp. Form.:
C17H17F2NO2
Mol. Mass.:
305.3192
SMILES:
Fc1cccc(OC(C2CNCCO2)c2ccccc2)c1F
: