Target
Histamine H1 receptor
Ligand
BDBM87024
Substrate
Ki
10±n/a nM
Comments
PDSP_8623
Citation
 Fish, PVDeur, CGan, XGreene, KHoople, DMackenny, MPara, KSReeves, KRyckmans, TStiff, CStobie, AWakenhut, FWhitlock, GA Design and synthesis of morpholine derivatives. SAR for dual serotonin & noradrenaline reuptake inhibition. Bioorg Med Chem Lett 18:2562-6 (2008)  
Target
Name:
Histamine H1 receptor
Synonyms:
H1R HISTAMINE H1 HRH1_HUMAN
Type:
G Protein-Coupled Receptor (GPCR)
Mol. Mass.:
55808.72
Organism:
Homo sapiens (Human)
Description:
Cell pellets from SK-N-MC cells transfected with human H1 receptor were used in binding assay.
Residue:
487
  
Inhibitor
Name:
BDBM87024
Synonyms:
(R)-2-((R)-(4-fluoro-2-methylphenoxy)(phenyl)methyl)morpholine CAS_44450184 NSC_44450184 | NSC_44450213
Type:
Small organic molecule
Emp. Form.:
C18H20FNO2
Mol. Mass.:
301.3553
SMILES:
Cc1cc(F)ccc1OC(C1CNCCO1)c1ccccc1
: