Target
Alpha-1D adrenergic receptor
Ligand
BDBM81790
Substrate
Ki
>10000±n/a nM
Comments
PDSP_287
Citation
 Abbas, AIHedlund, PBHuang, XPTran, TBMeltzer, HYRoth, BL Amisulpride is a potent 5-HT7 antagonist: relevance for antidepressant actions in vivo. Psychopharmacology (Berl) 205:119-28 (2009)  
Target
Name:
Alpha-1D adrenergic receptor
Synonyms:
ADA1D_HUMAN ADRA1D Adrenergic receptor alpha Alpha 1D-adrenoreceptor Alpha-1D adrenoceptor adrenergic Alpha1D
Type:
Enzyme Catalytic Domain
Mol. Mass.:
60485.82
Organism:
Homo sapiens (Human)
Description:
adrenergic Alpha1D ADRA1D HUMAN::P25100
Residue:
572
  
Inhibitor
Name:
BDBM81790
Synonyms:
Amisulpride NSC_2159 US10259786, Amisulpride
Type:
Small organic molecule
Emp. Form.:
C17H27N3O4S
Mol. Mass.:
369.479
SMILES:
CCN1CCCC1CNC(=O)c1cc(c(N)cc1OC)S(=O)(=O)CC
: