Target
Nuclear receptor coactivator 3
Ligand
BDBM63551
Substrate
Meas. Tech.
Luminescence-based cell-based high throughput dose response assay for inhibitors of the Steroid Receptor Coactivator 3 (SRC3; NCOA3)
IC50
4469±n/a nM
Citation
 PubChem, PC Luminescence-based cell-based high throughput dose response assay for inhibitors of the Steroid Receptor Coactivator 3 (SRC3; NCOA3) PubChem Bioassay (2012)[AID] 
Target
Name:
Nuclear receptor coactivator 3
Synonyms:
AIB1 NCOA3 RAC3 nuclear receptor coactivator 3 isoform a
Type:
Enzyme Catalytic Domain
Mol. Mass.:
155305.29
Organism:
Homo sapiens (Human)
Description:
Q9Y6Q9
Residue:
1424
  
Inhibitor
Name:
BDBM63551
Synonyms:
2-(1-butyl-4-pyridinylidene)indene-1,3-dione 2-(1-butylpyridin-4-ylidene)indene-1,3-dione SMR000289924 | cid_1915589
Type:
Small organic molecule
Emp. Form.:
C18H17NO2
Mol. Mass.:
279.3331
SMILES:
[#6]-[#6]-[#6]-[#6]-[#7]-1-[#6]=[#6]\[#6](-[#6]=[#6]-1)=[#6]-1/[#6](=O)-c2ccccc2-[#6]-1=O
: