Target
Tyrosine-protein kinase ABL1
Ligand
BDBM87440
Substrate
Meas. Tech.
TRFRET-based biochemical high throughput dose response assay for inhibitors of the interaction of the Ras and Rab interactor 1 protein (Rin1) and the c-abl oncogene 1
IC50
25911±n/a nM
Citation
 PubChem, PC TRFRET-based biochemical high throughput dose response assay for inhibitors of the interaction of the Ras and Rab interactor 1 protein (Rin1) and the c-abl oncogene 1, non-receptor tyrosine kinase (Abl) PubChem Bioassay (2012)[AID] 
Target
Name:
Tyrosine-protein kinase ABL1
Synonyms:
ABL ABL1_HUMAN JTK7 Proto-oncogene tyrosine-protein kinase ABL1 Tyrosine-protein kinase ABL V-abl Abelson murine leukemia viral oncogene homolog 1 p150 | tyrosine-protein kinase ABL1 isoform a
Type:
Enzyme
Mol. Mass.:
122897.30
Organism:
Homo sapiens (Human)
Description:
P00519
Residue:
1130
  
Inhibitor
Name:
BDBM87440
Synonyms:
4-[[1-oxo-2-[2-[(2-phenylethylamino)methyl]phenoxy]ethyl]amino]benzoic acid ethyl ester;hydrochloride MLS000664861 cid_2959810 ethyl 4-[[2-[2-[(2-phenylethylamino)methyl]phenoxy]acetyl]amino]benzoate;hydrochloride | ethyl 4-{[(2-{[(2-phenylethyl)amino]methyl}phenoxy)acetyl]amino}benzoate hydrochloride
Type:
Small organic molecule
Emp. Form.:
C26H28N2O4
Mol. Mass.:
432.5115
SMILES:
CCOC(=O)c1ccc(NC(=O)COc2ccccc2CNCCc2ccccc2)cc1
: