Target
Polyadenylate-binding protein 1
Ligand
BDBM87606
Substrate
Meas. Tech.
Dose-response secondary confirmation of microRNA-mediated mRNA deadenylation inhibitors by fluoresence polarization assay using Cy5 labeled peptide
IC50
>66000±n/a nM
Citation
 PubChem, PC Dose-response secondary confirmation of microRNA-mediated mRNA deadenylation inhibitors by fluoresence polarization assay using Cy5 labeled peptide PubChem Bioassay (2012)[AID] 
Target
Name:
Polyadenylate-binding protein 1
Synonyms:
PAB1 PABP1 PABPC1 poly(A) binding protein, cytoplasmic 1 | polyadenylate-binding protein 1
Type:
Enzyme Catalytic Domain
Mol. Mass.:
70694.26
Organism:
Homo sapiens (Human)
Description:
gi_46367787
Residue:
636
  
Inhibitor
Name:
BDBM87606
Synonyms:
2-(6-Amino-4-oxo-1-m-tolyl-1,4-dihydro-pyrimidin-2-ylsulfanyl)-N-(5-methyl-isoxazol-3-yl)-acetamide 2-[6-azanyl-1-(3-methylphenyl)-4-oxidanylidene-pyrimidin-2-yl]sulfanyl-N-(5-methyl-1,2-oxazol-3-yl)ethanamide 2-[[6-amino-4-keto-1-(m-tolyl)pyrimidin-2-yl]thio]-N-(5-methylisoxazol-3-yl)acetamide SMR000013543 | cid_651484
Type:
Small organic molecule
Emp. Form.:
C17H17N5O3S
Mol. Mass.:
371.414
SMILES:
Cc1cc(NC(=O)CSc2nc(=O)cc(N)n2-c2cccc(C)c2)no1
: