Target
Polyadenylate-binding protein 1
Ligand
BDBM87612
Substrate
Meas. Tech.
Dose-response secondary confirmation of microRNA-mediated mRNA deadenylation inhibitors by fluoresence polarization assay using Cy5 labeled peptide
IC50
>66000±n/a nM
Citation
 PubChem, PC Dose-response secondary confirmation of microRNA-mediated mRNA deadenylation inhibitors by fluoresence polarization assay using Cy5 labeled peptide PubChem Bioassay (2012)[AID] 
Target
Name:
Polyadenylate-binding protein 1
Synonyms:
PAB1 PABP1 PABPC1 poly(A) binding protein, cytoplasmic 1 | polyadenylate-binding protein 1
Type:
Enzyme Catalytic Domain
Mol. Mass.:
70694.26
Organism:
Homo sapiens (Human)
Description:
gi_46367787
Residue:
636
  
Inhibitor
Name:
BDBM87612
Synonyms:
3-Chloro-4-(4-methyl-piperazin-1-yl)-1-phenethyl-pyrrole-2,5-dione 3-chloro-4-(4-methyl-1-piperazinyl)-1-(2-phenylethyl)pyrrole-2,5-dione 3-chloro-4-(4-methylpiperazino)-1-phenethyl-3-pyrroline-2,5-quinone SMR000014936 | cid_653866
Type:
Small organic molecule
Emp. Form.:
C17H20ClN3O2
Mol. Mass.:
333.813
SMILES:
CN1CCN(CC1)C1=C(Cl)C(=O)N(CCc2ccccc2)C1=O
: