Target
Polyadenylate-binding protein 1
Ligand
BDBM34302
Substrate
Meas. Tech.
Dose-response secondary confirmation of microRNA-mediated mRNA deadenylation inhibitors by fluoresence polarization assay using Cy5 labeled peptide
IC50
>66000±n/a nM
Citation
 PubChem, PC Dose-response secondary confirmation of microRNA-mediated mRNA deadenylation inhibitors by fluoresence polarization assay using Cy5 labeled peptide PubChem Bioassay (2012)[AID] 
Target
Name:
Polyadenylate-binding protein 1
Synonyms:
PAB1 PABP1 PABPC1 poly(A) binding protein, cytoplasmic 1 | polyadenylate-binding protein 1
Type:
Enzyme Catalytic Domain
Mol. Mass.:
70694.26
Organism:
Homo sapiens (Human)
Description:
gi_46367787
Residue:
636
  
Inhibitor
Name:
BDBM34302
Synonyms:
3-(1-benzotriazolylmethyl)-6-(2-furanyl)-[1,2,4]triazolo[3,4-b][1,3,4]thiadiazole 3-(benzotriazol-1-ylmethyl)-6-(furan-2-yl)-[1,2,4]triazolo[3,4-b][1,3,4]thiadiazole SMR000048120 | cid_666827
Type:
Small organic molecule
Emp. Form.:
C14H9N7OS
Mol. Mass.:
323.333
SMILES:
C(c1nnc2sc(nn12)-c1ccco1)n1nnc2ccccc12
: