Target
Lethal factor
Ligand
BDBM1795
Substrate
Meas. Tech.
High-throughput multiplex microsphere dose response for inhibitors of toxin protease, specifically Lethal Factor protease, compounds from Cherry Pick 02
EC50
>20000±n/a nM
Citation
 PubChem, PC High-throughput multiplex microsphere dose response for inhibitors of toxin protease, specifically Lethal Factor protease, compounds from Cherry Pick 02 PubChem Bioassay (2012)[AID] 
Target
Name:
Lethal factor
Synonyms:
Anthrax Lethal Factor (LF) Antrax lethal toxin lef | lethal factor
Type:
PROTEIN
Mol. Mass.:
93758.56
Organism:
Bacillus anthracis
Description:
ChEMBL_1460338
Residue:
809
  
Inhibitor
Name:
BDBM1795
Synonyms:
cid_4092145
Type:
Emp. Form.:
C18H21N3O4S2
Mol. Mass.:
407.507
SMILES:
CCS(=O)(=O)N1N=C(CC1c1ccccc1)c1cccc(NS(C)(=O)=O)c1
: