Target
Isocitrate dehydrogenase [NADP] cytoplasmic [R132C]
Ligand
BDBM278583
Substrate
Meas. Tech.
Inhibitory Activity Against IDH1R132H and IDH1R132C Enzymes
pH
7.5±n/a
Temperature
298.15±n/a K
IC50
114±n/a nM
Comments
extracted
Citation
 Saito, SItoh, MFujisawa, TSaito, HKiyotsuka, YWatanabe, HMatsunaga, HKagoshima, YSuzuki, TOgawara, YKitabayashi, K Isoxazole derivative as mutant isocitrate dehydrogenase 1 inhibitor US Patent  US10040791 Publication Date 8/7/2018 
Target
Name:
Isocitrate dehydrogenase [NADP] cytoplasmic [R132C]
Synonyms:
IDH1 IDH1(R132C) Isocitrate dehydrogenase (IDH1)(R132C) Isocitrate dehydrogenase [NADP] cytoplasmic (IDH1) (R132C) | PICD
Type:
Enzyme Catalytic Domain
Mol. Mass.:
46607.23
Organism:
Homo sapiens (Human)
Description:
O75874[R132C]
Residue:
414
  
Inhibitor
Name:
BDBM278583
Synonyms:
(2E)-3-(3-Fluoro-1-{[5-(2-fluoropropan-2-yl)-3-(2,4,6-trichlorophenyl)-1,2-oxazol-4-yl]carbonyl}-1H-indol-4-yl)prop-2-enoic acid | US10040791, Example 45
Type:
Small organic molecule
Emp. Form.:
C24H15Cl3F2N2O4
Mol. Mass.:
539.743
SMILES:
CC(C)(F)c1onc(c1C(=O)n1cc(F)c2c(\C=C\C(O)=O)cccc12)-c1c(Cl)cc(Cl)cc1Cl
: