Target
Isocitrate dehydrogenase [NADP] cytoplasmic [R132H]
Ligand
BDBM278604
Substrate
Meas. Tech.
Inhibitory Activity Against IDH1R132H and IDH1R132C Enzymes
pH
7.5±n/a
Temperature
298.15±n/a K
IC50
14±n/a nM
Comments
extracted
Citation
 Saito, SItoh, MFujisawa, TSaito, HKiyotsuka, YWatanabe, HMatsunaga, HKagoshima, YSuzuki, TOgawara, YKitabayashi, K Isoxazole derivative as mutant isocitrate dehydrogenase 1 inhibitor US Patent  US10040791 Publication Date 8/7/2018 
Target
Name:
Isocitrate dehydrogenase [NADP] cytoplasmic [R132H]
Synonyms:
Cytosolic NADP-isocitrate dehydrogenase (IDH1)(R132H) IDH1 R132H IDHC_HUMAN Isocitrate dehydrogenase 1 mutant (R132H) Isocitrate dehydrogenase [NADP] cytoplasmic (IDH1)(R132H) PICD
Type:
Protein
Mol. Mass.:
46641.74
Organism:
Homo sapiens (Human)
Description:
Human IDH1 R132H (SEQ ID No. 2 in patent). First three are removed. Google patent parsed wrong.
Residue:
414
  
Inhibitor
Name:
BDBM278604
Synonyms:
(2E)-3-(3-Chloro-1-{[5-(2- fluoropropan-2-yl)-3-(2,4,6- trichlorophenyl)-1,2-oxazol-4- yl]carbonyl}-1H-indol-4- yl)prop-2-enoic acid | US10040791, Example 66
Type:
Small organic molecule
Emp. Form.:
C24H15Cl4FN2O4
Mol. Mass.:
556.197
SMILES:
CC(C)(F)c1onc(c1C(=O)n1cc(Cl)c2c(\C=C\C(O)=O)cccc12)-c1c(Cl)cc(Cl)cc1Cl
: