Target
Mitochondrial import inner membrane translocase subunit TIM10
Ligand
BDBM89082
Substrate
Meas. Tech.
SAR analysis of small molecule inhibitors of tim23-1: a luminescent TIM10 yeast counterscreen.
IC50
35600±n/a nM
Citation
 PubChem, PC SAR analysis of small molecule inhibitors of tim23-1: a luminescent TIM10 yeast counterscreen. PubChem Bioassay (2012)[AID] 
Target
Name:
Mitochondrial import inner membrane translocase subunit TIM10
Synonyms:
MRS11 TIM10_YEAST TPA: Essential protein of the mitochondrial intermembrane space, forms a complex with Tim9p (TIM10 complex) that delivers hydrophobic proteins to the TIM22 complex for insertion into the inner ...
Type:
Enzyme Catalytic Domain
Mol. Mass.:
10303.50
Organism:
Saccharomyces cerevisiae S288c
Description:
gi_285809906
Residue:
93
  
Inhibitor
Name:
BDBM89082
Synonyms:
3,7-dimethyl-5-oxidanylidene-N-[3-(trifluoromethyl)phenyl]-[1,3]thiazolo[3,2-a]pyrimidine-6-sulfonamide 3,7-dimethyl-5-oxo-N-[3-(trifluoromethyl)phenyl]-[1,3]thiazolo[3,2-a]pyrimidine-6-sulfonamide MLS-0463353.0001 | cid_15990016
Type:
Small organic molecule
Emp. Form.:
C15H12F3N3O3S2
Mol. Mass.:
403.399
SMILES:
Cc1csc2nc(C)c(c(=O)n12)S(=O)(=O)Nc1cccc(c1)C(F)(F)F
: